Nightly Test run #55
Annotations
3 errors, 2 warnings, and 2 notices
Error handling test during JS view execution ► Check error handling when rendering a crashing JS view ► Error handling test during JS view execution Check error handling when rendering a crashing JS view:
javascript-modules-engine/tests/artifacts/results/xml_reports/cypress/e2e/ui/crashingViewTest.cy.ts.xml#L0
Failed test found in:
javascript-modules-engine/tests/artifacts/results/xml_reports/cypress/e2e/ui/crashingViewTest.cy.ts.xml
Error:
AssertionError: Timed out retrying after 30000ms: Expected to find element: `[data-sel-role="page-builder-frame-active"]`, but never found it.
|
Integration Tests (Standalone) (jahia/jahia-ee-dev:8-SNAPSHOT)
Run has FAILED, could not locate file /opt/actions-runner/_work/javascript-modules/javascript-modules/javascript-modules-engine/tests/artifacts/results/test_success
|
Error handling test during JS view execution ► Check error handling when rendering a crashing JS view ► Error handling test during JS view execution Check error handling when rendering a crashing JS view:
javascript-modules-engine/tests/artifacts/results/xml_reports/cypress/e2e/ui/crashingViewTest.cy.ts.xml#L0
Failed test found in:
javascript-modules-engine/tests/artifacts/results/xml_reports/cypress/e2e/ui/crashingViewTest.cy.ts.xml
Error:
AssertionError: Timed out retrying after 30000ms: Expected to find element: `[data-sel-role="page-builder-frame-active"]`, but never found it.
|
Integration Tests (Standalone) (jahia/jahia-ee-dev:8-SNAPSHOT)
This job failure may be caused by using an out of date self-hosted runner. You are currently using runner version 2.320.0. Please update to the latest version 2.321.0
|
Integration Tests (Standalone) (jahia/jahia-ee-dev:8-SNAPSHOT)
Input 'should_use_build_artifacts' has been deprecated with message: This input is deprecated. Build artifacts are now downloaded if available
|
Integration Tests (Standalone) (jahia/jahia-ee-dev:8-SNAPSHOT)
Job is running on instance: i-0947c312c63b78f92 (spec: t3a.2xlarge
) - Connect to the instance using: #> aws ssm start-session --target i-0947c312c63b78f92
|
Integration Tests (Standalone) (jahia/jahia-ee-dev:8-SNAPSHOT)
Artifacts (VPN Required) have been uploaded to: https://qa.jahia.com/artifacts-ci/delete-on-2025-02-11_Jahia_javascript-modules_integration-tests-results_12728801980_1
|
Artifacts
Produced during runtime
Name | Size | |
---|---|---|
js-eng-0-55
Expired
|
61.3 MB |
|