scripts/run_commit_tests.sh #67
GitHub Actions / JUnit Results
succeeded
Dec 15, 2024 in 1s
45 passed, 1 failed and 0 skipped
❌ junit.xml
46 tests were completed in 32s with 45 passed, 1 failed and 0 skipped.
Test suite | Passed | Failed | Skipped | Time |
---|---|---|---|---|
HYPERON-EXPERIMENTAL-SCRIPTS | 7✅ | 19ms | ||
HYPERON-METTALOG-SANITY | 18✅ | 67ms | ||
MODULE-SYSTEM | 16✅ | 1❌ | 175ms | |
WHOLE-TESTS | 4✅ | 32s |
✅ HYPERON-EXPERIMENTAL-SCRIPTS
✅ A1-SYMBOLS.01
✅ A1-SYMBOLS.02
✅ A1-SYMBOLS.03
✅ A1-SYMBOLS.04
✅ A1-SYMBOLS.05
✅ A1-SYMBOLS.06
✅ A1-SYMBOLS.07
✅ HYPERON-METTALOG-SANITY
✅ 00-LANG-CASE.01
✅ 00-LANG-CASE.02
✅ 00-LANG-CASE.03
✅ 00-LANG-CASE.04
✅ 00-LANG-CASE.05
✅ 00-LANG-CASE.06
✅ 00-LANG-CASE.07
✅ 00-LANG-CASE.08
✅ 00-LANG-CASE.09
✅ 00-LANG-CASE.10
✅ 00-LANG-CASE.11
✅ 00-LANG-CASE.12
✅ 00-LANG-CASE.13
✅ 00-LANG-CASE.14
✅ 00-LANG-CASE.15
✅ 00-LANG-CASE.16
✅ 00-LANG-CASE.17
✅ 00-LANG-CASE.18
❌ MODULE-SYSTEM
✅ F1-IMPORTS.01
✅ F1-IMPORTS.02
✅ F1-MODULEA.03
❌ F1-IMPORTS.04
AssertionError: Test failed: Expected '(True)' but got '()'
✅ F1-IMPORTS.05
✅ F1-MODULEA.06
✅ F1-IMPORTS.07
✅ F1-IMPORTS.08
✅ F1-IMPORTS.09
✅ F1-IMPORTS.10
✅ F1-IMPORTS.11
✅ F1-IMPORTS.12
✅ F1-IMPORTS.13
✅ F1-IMPORTS.14
✅ F1-IMPORTS.15
✅ F1-IMPORTS.16
✅ F1-MODULEA.01
✅ WHOLE-TESTS
✅ module-system.f1_imports
✅ module-system.f1_moduleA
✅ hyperon-experimental_scripts.a1_symbols
✅ hyperon-mettalog_sanity.00_lang_case
Annotations
Check failure on line 0 in junit.xml
github-actions / JUnit Results
MODULE-SYSTEM ► F1-IMPORTS.04
Failed test found in:
junit.xml
Error:
AssertionError: Test failed: Expected '(True)' but got '()'
Raw output
AssertionError: Test failed: Expected '(True)' but got '()'
Loading